Target
Muscarinic acetylcholine receptor M3
Ligand
BDBM50297129
Substrate
Meas. Tech.
ChEMBL_750511 (CHEMBL1786272)
IC50
1939±n/a nM
Citation
 Lainé, DIWan, ZYan, HZhu, CXie, HFu, WBusch-Petersen, JNeipp, CDavis, RWiddowson, KLBlaney, FEFoley, JBacon, AMWebb, EFLuttmann, MABurman, MSarau, HMSalmon, MPalovich, MRBelmonte, K Design, synthesis, and structure-activity relationship of tropane muscarinic acetylcholine receptor antagonists. J Med Chem 52:5241-52 (2010)  
Target
Name:
Muscarinic acetylcholine receptor M3
Synonyms:
ACM3_HUMAN Cholinergic, muscarinic M3 Muscarinic receptor M3 | RecName: Full=Muscarinic acetylcholine receptor M3
Type:
Enzyme
Mol. Mass.:
66151.03
Organism:
Homo sapiens (Human)
Description:
P20309
Residue:
590
  
Inhibitor
Name:
BDBM50297129
Synonyms:
CHEMBL552481 | endo-1-ethyl-3-(3-(8-methyl-8-azabicyclo[3.2.1]octan-3-yl)-2,2-diphenylpropyl)urea
Type:
Small organic molecule
Emp. Form.:
C26H35N3O
Mol. Mass.:
405.5756
SMILES:
CCNC(=O)NCC(CC1C[C@H]2CC[C@H](C1)N2C)(c1ccccc1)c1ccccc1
: