Target
ALK tyrosine kinase receptor
Ligand
BDBM50185288
Substrate
Meas. Tech.
ChEMBL_1587416 (CHEMBL3824709)
IC50
0.790000±n/a nM
Citation
 Huang, WSLiu, SZou, DThomas, MWang, YZhou, TRomero, JKohlmann, ALi, FQi, JCai, LDwight, TAXu, YXu, RDodd, RToms, AParillon, LLu, XAnjum, RZhang, SWang, FKeats, JWardwell, SDNing, YXu, QMoran, LEMohemmad, QKJang, HGClackson, TNarasimhan, NIRivera, VMZhu, XDalgarno, DShakespeare, WC Discovery of Brigatinib (AP26113), a Phosphine Oxide-Containing, Potent, Orally Active Inhibitor of Anaplastic Lymphoma Kinase. J Med Chem 59:4948-64 (2016)  
Target
Name:
ALK tyrosine kinase receptor
Synonyms:
ALK ALK_HUMAN CD_antigen: CD246
Type:
Protein
Mol. Mass.:
176453.10
Organism:
Homo sapiens (Human)
Description:
Q9UM73
Residue:
1620
  
Inhibitor
Name:
BDBM50185288
Synonyms:
CHEMBL3824326
Type:
Small organic molecule
Emp. Form.:
C21H22ClN4O3P
Mol. Mass.:
444.851
SMILES:
COc1cc(ccc1Nc1ncc(Cl)c(Nc2ccccc2C(C)=O)n1)P(C)(C)=O
: