Target
Cyclin-A2/Cyclin-dependent kinase 2
Ligand
BDBM7107
Substrate
Histone H1
Meas. Tech.
Kinase SPA Assay
IC50
2±n/a nM
Citation
 Pevarello, PBrasca, MGOrsini, PTraquandi, GLongo, ANesi, MOrzi, FPiutti, CSansonna, PVarasi, MCameron, AVulpetti, ARoletto, FAlzani, RCiomei, MAlbanese, CPastori, WMarsiglio, APesenti, EFiorentini, FBischoff, JRMercurio, C 3-Aminopyrazole inhibitors of CDK2/cyclin A as antitumor agents. 2. Lead optimization. J Med Chem 48:2944-56 (2005)  
Target
Name:
Cyclin-A2/Cyclin-dependent kinase 2
Synonyms:
CDK2-CyclinA CDK2/Cyclin A Cyclin A2/dependent kinase 2 Cyclin-Dependent Kinase 2 (CDK2A)
Type:
Protein Complex
Mol. Mass.:
Description:
Cdk2/Cyclin A kinase was purified from insect cells coinfected with Cyclin A/Cdk2 baculovirus.
Components:
This complex has 2 components.
Component 1
Name:
Cyclin-dependent kinase 2
Synonyms:
CDK2 CDK2_HUMAN Cell division protein kinase 2 Protein cereblon/Cyclin-dependent kinase 2 | p33 protein kinase
Type:
Enzyme Subunit
Mol. Mass.:
33938.17
Organism:
Homo sapiens (Human)
Description:
P24941
Residue:
298
  
Component 2
Name:
Cyclin-A2
Synonyms:
CCN1 CCNA1 CCNA2_HUMAN Cyclin-A
Type:
Enzyme Subunit
Mol. Mass.:
48550.19
Organism:
Homo sapiens (Human)
Description:
P20248
Residue:
432
  
Inhibitor
Name:
BDBM7107
Synonyms:
(2S)-N-(5-Cyclopropyl-1H-pyrazol-3-yl)-2-[4-(1-oxo-1,3-dihydro-2H-isoindol-2-yl)phenyl]propanamide 3-Aminopyrazole deriv. 20 | CHEMBL190446
Type:
Small organic molecule
Emp. Form.:
C23H22N4O2
Mol. Mass.:
386.4464
SMILES:
C[C@H](C(=O)Nc1cc(n[nH]1)C1CC1)c1ccc(cc1)N1Cc2ccccc2C1=O
:
Substrate
Name:
Histone H1
Synonyms:
Type:
Other Protein Type
Mol. Mass.:
358.43
Organism:
Bos taurus (bovine)
Description:
Residue:
3
NA