Target
Cannabinoid receptor 2
Ligand
BDBM50218119
Substrate
Meas. Tech.
ChEMBL_444839 (CHEMBL895094)
IC50
660±n/a nM
Citation
 Dziadulewicz, EKBevan, SJBrain, CTCoote, PRCulshaw, AJDavis, AJEdwards, LJFisher, AJFox, AJGentry, CGroarke, AHart, TWHuber, WJames, IFKesingland, ALa Vecchia, LLoong, YLyothier, IMcNair, KO'Farrell, CPeacock, MPortmann, RSchopfer, UYaqoob, MZadrobilek, J Naphthalen-1-yl-(4-pentyloxynaphthalen-1-yl)methanone: a potent, orally bioavailable human CB1/CB2 dual agonist with antihyperalgesic properties and restricted central nervous system penetration. J Med Chem 50:3851-6 (2007)  
Target
Name:
Cannabinoid receptor 2
Synonyms:
CANNABINOID CB2 CB2 CB2B CNR2_HUMAN Cannabinoid CB2 receptor Cannabinoid receptor 2 (CB2R) | hCB2
Type:
G Protein-Coupled Receptor (GPCR)
Mol. Mass.:
39690.94
Organism:
Homo sapiens (Human)
Description:
P34972
Residue:
360
  
Inhibitor
Name:
BDBM50218119
Synonyms:
(4-hexyloxynaphthalen-1-yl)naphthalen-1-ylmethanone | CHEMBL244606
Type:
Small organic molecule
Emp. Form.:
C27H26O2
Mol. Mass.:
382.4941
SMILES:
CCCCCCOc1ccc(C(=O)c2cccc3ccccc23)c2ccccc12
: