Target
Cannabinoid receptor 1
Ligand
BDBM50218120
Substrate
Meas. Tech.
ChEMBL_444838 (CHEMBL895093)
IC50
300±n/a nM
Citation
 Dziadulewicz, EKBevan, SJBrain, CTCoote, PRCulshaw, AJDavis, AJEdwards, LJFisher, AJFox, AJGentry, CGroarke, AHart, TWHuber, WJames, IFKesingland, ALa Vecchia, LLoong, YLyothier, IMcNair, KO'Farrell, CPeacock, MPortmann, RSchopfer, UYaqoob, MZadrobilek, J Naphthalen-1-yl-(4-pentyloxynaphthalen-1-yl)methanone: a potent, orally bioavailable human CB1/CB2 dual agonist with antihyperalgesic properties and restricted central nervous system penetration. J Med Chem 50:3851-6 (2007)  
Target
Name:
Cannabinoid receptor 1
Synonyms:
CANN6 CB-R CNR CNR1_HUMAN Cannabinoid receptor Cannabinoid receptor 1 (brain)
Type:
G Protein-Coupled Receptor (GPCR)
Mol. Mass.:
52868.96
Organism:
Homo sapiens (Human)
Description:
P21554
Residue:
472
  
Inhibitor
Name:
BDBM50218120
Synonyms:
CHEMBL243334 | naphthalen-1-yl-(4-propoxynaphthalen-1-yl)methanone
Type:
Small organic molecule
Emp. Form.:
C24H20O2
Mol. Mass.:
340.4144
SMILES:
CCCOc1ccc(C(=O)c2cccc3ccccc23)c2ccccc12
: